{"text_format":"1","workbook":"xlsx","n_sheets":7,"sheets":["CAMSS","Read me","CAMSS Log","CAMSS Proposal","CAMSS Consideration","CAMSS Assessment","CAMSS Recommendation"],"not_rendered":{"charts":2,"images":4,"macros":1,"external_links":0,"defined_names":27,"comments":0,"pivot_tables":0},"unopened":[],"bounds":{"document_bytes":16777216,"sheet_cells":100000,"rows_first":2000,"rows_last":500,"rows_between":2000,"halvings":0,"cell_chars":16384,"cell_head_chars":4096},"cells_cut":0,"cells_raw":0,"read":"whole","date_system":"1900"}

{"sheet":"CAMSS","index":0,"n_rows":21,"n_cols":12,"rows_kept":21,"cut":false,"hidden":false,"merged":[[17,3,17,9],[12,0,12,12],[13,0,13,12],[14,0,14,12],[15,0,15,12],[16,0,16,12]]}
[]
[]
[]
[]
[]
[]
[]
[]
[]
[]
["CAMSS - Common Assessment Method for Standards and Specifications"]
[]
[]
["Tool to assess Standards, Specifications and Standard Organisations"]
["v 0.9"]
[]
[]
[null,null,null,"Scenario 2 - Output: Assessed formal specification"]
[]
[]
{"$rows_left_out":2}
{"sheet":"Read me","index":1,"n_rows":72,"n_cols":8,"rows_kept":72,"cut":false,"hidden":false,"merged":[[21,5,21,10],[1,7,2,11],[5,1,8,10],[9,1,9,10],[10,1,10,10],[19,5,19,10],[11,1,11,10],[55,1,55,3],[23,5,23,10],[25,5,25,10],[27,5,27,10],[29,5,29,10],[31,5,31,10],[36,5,37,5],[39,5,40,5],[42,5,43,5],[45,5,46,5],[48,5,49,5],[52,6,52,10],[71,1,71,3],[82,5,82,10],[84,5,84,10],[56,1,56,3],[60,1,60,3],[61,1,61,3],[65,1,65,3],[66,1,66,3],[70,1,70,3]]}
[]
[null,"CAMSS v0.9",null,null,null,null,null,"Directorate-General for Informatics (DIGIT)      "]
[]
[]
[]
[null,"The main objective of this project is to establish and maintain a framework for assessing interoperability standards and specifications. This framework will provide European administrations with a well-defined and easy-to-use framework and method for assessing ICT interoperability standards and specifications, will ensure that assessments of ICT standards and specifications can be made faster, easier and with higher quality and will enable the reuse, in whole or in part, of such assessments."]
[]
[]
[]
[null,"The structure of this file is explained here"]
[null,"A high-level overview of the process method that formed the basis of the assessment can be found below"]
[null,"In case you need further information, please visit our wiki page"]
[]
[null,"Structure of this document"]
[]
[null,"This file consists of 4 tabs corresponding to phases of assessment scenario #2 (Proposal, Consideration, Assessment, Recommendation)."]
[]
[null,"The following columns are within the tabs:"]
[]
[null,null,null,"Category\\sub-category",null,"This column lists the categories\\sub-categories of a group of criteria."]
{"$rows_left_out":53}
{"sheet":"CAMSS Log","index":2,"n_rows":16,"n_cols":8,"rows_kept":16,"cut":false,"hidden":false,"merged":[[0,0,0,6]]}
["Assessment Log"]
["Nr.","Category","Nr.","MSP Nr.","CAMSS Nr.","Criteria","Description","Response"]
[1,"Information on the submitter","L.1",1,11,"Name, First name"]
[null,null,"L.2",2,10,"Organisation"]
[null,null,"L.3",3,null,"Position / Role"]
[null,null,"L.4",4,null,"Contact Address"]
[null,null,"L.5",4,13,"Contact Phone number"]
[null,null,"L.6",4,12,"Contact email"]
[null,null,"L.7",5,3,"Date of submission"]
[null,null,null,null,1,"Scenario for assessment","Describe the specific scenario for the proposed technical specification\\standard or organisation. For the CAMSS process, already 3 basic scenarios are defined including the assessment of an organisation, the proposal of a technical specification\\standard or the assessment in the context of a business need."]
[null,null,null,null,4,"Public administration","Describe the public administration for which the technical specification or standard will be adopted."]
[null,null,null,null,5,"Alternatives considered","Describe the possible alternatives that were considered during the assessment process."]
[null,null,null,null,6,"Process approach"]
[null,null,null,null,7,"Members of Assessment panel ","List the people and/or roles involved in the different steps of the assessment and evaluation of the proposed technical specification or standard."]
[null,null,null,null,8,"Consultation and validation roles","List the people and/or roles involved in the consultation and validation during the different steps assessment process (e.g. public, certain stakeholders, competitors, …)"]
[null,null,null,null,9,"Members of decision making body","List the people and/or roles involved in the decision making process."]

{"sheet":"CAMSS Proposal","index":3,"n_rows":29,"n_cols":9,"rows_kept":29,"cut":false,"hidden":false,"merged":[[0,0,0,9]]}
[]
["Nr. ","Category","Nr.","MSP Nr.","CAMSS Nr.","Org.","Criteria","Description","Response"]
[1,"Information on the submission","P.1",6,"1\n7\n8","O","Title of the specification","The term “ICT specification” is used in the Regulation 1025/2012, Article 13, for specifications in the field of ICT that have been identified following the process of assessment against the Requirements and criteria laid down in Annex II to the Regulation. The ‘specification’ (as it will be cited along the present submission form) may be a single one or a ‘coherent set’ of ICT specifications; in all the cases the identity (including version) of each single document needs to be clearly announced, e.g. in one attached document"]
[null,null,"P.2",7,null,null,"Address where the version of the specification can be obtained/downloaded"]
[null,null,"P.3",8,16,"O","Name, identifier and website of the standard developing organisation (SDO) of the specification"]
[null,null,"P.4",9,null,null,"Contact information/contact person (including email address and phone number)\na.) for the organisation (optional)\nb.) for the specification submitted (optional)\n"]
[null,null,"P.5",10,null,null,"Describe the reason for the submission, the need and intended use for the specification"]
[null,null,"P.6",11,null,null,"Is any other evaluation of this specification known, e.g. by member states or European Commission projects? If so, provide a link to this evaluation and –if possible- attach the evaluation in in Annex 1 of this form."]
[null,null,"P.7",12,null,null,"State whether this submission concerns:\nA) Identification of a new specification\nB) a revision of an already identified specification \nC) a proposal to withdraw the identification of an already identified specification  \n"]
[null,null,"P.8","12.a",null,null,"If P.7, Case B, applies:\nplease provide information on backward and forward compatibility with the version already approved. \n"]
[null,null,"P.9","12.b",null,null,"If P.7, Case C applies:\nexplain why the ICT specification  no longer complies with the requirements for identification or the reasons for its withdrawal \n"]
[null,null,"P.10",13,null,null,"Is the submitted ICT specification:\nA) the first ICT specification from this standards developing organisation\nB) an ICT specification coming from a SDO of which a specification has previously been identified and which has undergone the same development and approval processes in the organisation.\n","If P.10 B applies please give information concerning the identified ICT specification(s). "]
[null,null,null,null,2,null,"Date of creation","Creation date of this version of the asset"]
[null,null,null,null,3,null,"Date of last modification","Date of latest update of asset"]
[null,null,null,null,4,"O","Description","Descriptive text for the asset"]
[null,null,null,null,5,null,"ID","URI for the asset"]
[null,null,null,null,6,"O","Keyword","Word or phrase to describe the asset"]
[null,null,null,null,9,"O","Asset type","Classification of an asset according to a controlled vocabulary, e.g. code list, metadata schema"]
[null,null,null,null,10,null,"Current version","Current or latest version of the asset"]
[null,null,null,null,11,"O","Documentation","Document that further describes an asset or give guidelines for its use"]
{"$rows_left_out":10}
{"sheet":"CAMSS Consideration","index":4,"n_rows":9,"n_cols":8,"rows_kept":9,"cut":false,"hidden":false,"merged":[[0,0,0,7]]}
[]
["Nr. ","Category","Description","Nr.","Org.","Criteria","Response \n(Yes/No)","Justification"]
[1,"Correctness","The proposal for the assessment of technical specifications or standards is provided correctly and the necessary documentation is provided.","C.1","O","Is the proposal information from previous tabpage correctly provided?"]
[null,null,null,"C.2","O","Is the complete documentation provided for performing the assessment?"]
[]
[2,"Relevance","The proposal for the assessment of technical specifications or standards falls within the relevant areas of the public administration.","C.3",null,"Is the functional area of application for the formal specification addressing interoperability and eGovernment?"]
[null,null,null,"C.4",null,"Is the formal specification meeting the business needs?"]
[]
[3,"Legislation and regulation","The proposal for the assessment of technical specifications or standards does not impede any legislative or regulatory requirements.","C.5","O","Is the formal specification not hampering the regulatory requirements for the area of application?"]

{"sheet":"CAMSS Assessment","index":5,"n_rows":53,"n_cols":16,"rows_kept":53,"cut":false,"hidden":false,"merged":[[0,0,0,14]]}
[]
["Nr.","Category","Description","Nr.","Sub-Category","Description","Nr.","MSP Nr.","CAMSS Nr.","Org.","Criteria","Description","KO","Response \n(Yes/No/Not Applicable)","Quantification","Justification"]
[0,"Technical specification or standard",null,"1.0","Type of technical specification or standard",null,"A.0",null,0,null,"What type of technical specification or standard are you about to assess?","Types of technical specifications/standards: European standard, European identified specification, national standard, international specifications, other technical specifications.",null,"Select value from the list"]
[1,"Market acceptance","The technical specifications have market acceptance and their implementations do not hamper interoperability with the implementations of existing European or international standards. Market acceptance can be demonstrated by operational examples of compliant implementations from different vendors.",null,null,null,"A.1",14,28,null,"Has the specification been used for different implementations by different vendors/suppliers? ",null,null,"Not Applicable"]
[null,null,null,null,null,null,"A.2",15,null,null,"Does the implementation of the specification hamper interoperability with the implementation of existing European or international standards? ",null,null,"Not Applicable"]
[null,null,null,null,null,null,"A.3",16,null,null,"Are you aware of public references of the respective specification by public authorities (especially policies or in procurements)",null,null,"Not Applicable"]
[null,null,null,null,null,null,"A.4",null,29,null,"Has the technical specification or standard been used in different industries, business sectors or functions?",null,null,"Not Applicable"]
[null,null,null,null,null,null,"A.5",null,30,null,"Do the products that implement the technical specification or standard have a significant market share of adoption?","For ‘market demand’, the penetration and acceptance of products implementing the technical specification or standard in the market is addressed.",null,"Not Applicable"]
[null,null,null,null,null,null,"A.6",null,31,null,"Do the products that implement the technical specification or standard target a broad spectrum of end-users?","For the ‘users’, the diversity of the end-users of the products implementing the technical specification or standard is addressed.",null,"Not Applicable"]
[null,null,null,null,null,null,"A.7",null,32,null,"Has the technical specification or standard a strong support from different interest groups?","For the ‘interest groups’, the degree of support from different interest groups is addressed.",null,"Not Applicable"]
[2,"Coherence principle","The technical specifications are coherent as they do not conflict with European standards, that is to say they cover domains where the adoption of new European standards is not foreseen within a reasonable period, where existing standards have not gained market uptake or where these standards have become obsolete, and where the transposition of the technical specifications into European standardisation deliverables is not foreseen within a reasonable period.",null,null,null,"A.8",17,49,null,"Does the technical specification or standard cover areas different from areas addressed by technical specifications being under consideration to become a European standard? \n(i.e. technical specifications provided by a non-formal standardisation organisation, that is other than CEN, CENELEC or ETSI can be under consideration to become a European standard or alternatively an identified technical specification)",null,null,"Not Applicable"]
[null,null,null,null,null,null,"A.9",18,"47\n48",null,"a/ Is the adoption of new European Standards which cover the same areas as the proposed specification (or standard) foreseen within a reasonable timeframe? . \n\nb/ Are there existing European standards with market uptake which cover the same areas as the proposed specification (or standard) being assessed?\n\nc/ If yes, are the existing standards becoming obsolete?\n",null,null,"Not Applicable"]
[null,null,null,null,null,null,"A.10",null,46,null,"Is the standard an international standard or does it comply with relevant international standards?","Technical specifications is coherent if it covers an area different from an area already addresssed by an existing European standard",null,"Not Applicable"]
[null,null,null,null,null,null,"A.11",null,50,null,"Is the standard or specification listed as recommended in at least one Member State?",null,null,"Not Applicable"]
[null,null,null,null,null,null,"A.12",null,51,null,"Is the standard or specification listed as mandatory in at least one Member State?",null,null,"Not Applicable"]
[3,"Attributes","The technical specifications were developed by a non-profit making organisation which is a professional society, industry or trade association or any other membership organisation that within its area of expertise develops standards in the field of information and communication technologies and which is not a European, national or international standardisation body",null,null,null,"A.13",19,null,null,"Is the standards developing organisation a non-profit making organisation? ",null,null,"Not Applicable"]
[null,null,null,null,null,null,"A.14",null,16,"O","Is information on the terms and policies for the establishment and operation of the standardisation organisation publicly available?","For the ‘openness’ of the organisation, the level of openness for participating in the standardisation organisation is addressed.",null,{"$f":"IF($N$3=\"European Standard\",\"Yes\",IF($N$3=\"European Identified Specification\",\"Yes\",IF($N$3=\"Member State standard\",\"Yes\",\"Not Applicable\")))","v":"Not Applicable"}]
[null,null,null,"3.1","Openness","the technical specifications were developed on the basis of open decision-making accessible to all interested parties in the market or markets affected by the standard.","A.15",20,17,"O","Is participation in the creation process of the specification open to all interested parties (e.g. organisations, companies or individuals)?",null,null,{"$f":"IF($N$3=\"European Standard\",\"Yes\",IF($N$3=\"European Identified Specification\",\"Yes\",IF($N$3=\"Member State standard\",\"Yes\",\"Not Applicable\")))","v":"Not Applicable"}]
[null,null,null,null,null,null,"A.16",null,21,"O","Are the technical specification or standards reviewed using a formal review process with all relevant external stakeholders (e.g. public consultation)?",null,null,{"$f":"IF($N$3=\"European Standard\",\"Yes\",IF($N$3=\"European Identified Specification\",\"Yes\",IF($N$3=\"Member State standard\",\"Yes\",\"Not Applicable\")))","v":"Not Applicable"}]
[null,null,null,"3.2","Consensus","the decision-making process was collaborative and consensus based and did not favour any particular stakeholder. Consensus means a general agreement, characterised by the absence of sustained opposition to substantial issues by any important part of the concerned interests and by a process that involves seeking to take into account the views of all parties concerned and to reconcile any conflicting arguments. Consensus does not imply unanimity.","A.17",21,20,"O","Are the specifications approved in a decision making process which aims at reaching consensus?",null,null,{"$f":"IF($N$3=\"European Standard\",\"Yes\",IF($N$3=\"European Identified Specification\",\"Yes\",IF($N$3=\"Member State standard\",\"Yes\",\"Not Applicable\")))","v":"Not Applicable"}]
{"$rows_left_out":34}
{"sheet":"CAMSS Recommendation","index":6,"n_rows":17,"n_cols":12,"rows_kept":17,"cut":false,"hidden":false,"merged":[[12,5,12,6],[13,5,13,6],[14,5,14,6],[16,5,16,6],[0,0,0,7]]}
[]
["Nr.","Category","Automated Score",null,"Knock-Out Criteria met?",null,"Evaluation","Comments","CAMSS Assessment Strength","# Yes","# No","# Not Applicable"]
["R.0","Formal specification"]
["R.1","Market acceptance",{"$f":"COUNTIF('CAMSS Assessment'!N4:N10, \"Yes\") / ( COUNTIF('CAMSS Assessment'!N4:N10, \"Yes\") + COUNTIF('CAMSS Assessment'!N4:N10, \"No\"))","v":{"$error":"#DIV/0!"}},null,{"$f":"IF(COUNTIF('CAMSS Assessment'!M4:M10, \"Yes\"), \"Yes\", \" \")","v":" "},null,null,null,{"$f":"(COUNTIF('CAMSS Assessment'!N4:N10,\"Yes\")+COUNTIF('CAMSS Assessment'!N4:N10,\"No\"))/7","v":0},{"$f":"(COUNTIF('CAMSS Assessment'!N4:N10,\"Yes\"))","v":0},{"$f":"COUNTIF('CAMSS Assessment'!N4:N10,\"No\")","v":0},{"$f":"COUNTIF('CAMSS Assessment'!N4:N10,\"Not Applicable\")","v":7}]
["R.2","Coherence principle",{"$f":"COUNTIF('CAMSS Assessment'!N11:N15, \"Yes\") / ( COUNTIF('CAMSS Assessment'!N11:N15, \"Yes\") + COUNTIF('CAMSS Assessment'!N11:N15, \"No\"))","v":{"$error":"#DIV/0!"}},null,{"$f":"IF(COUNTIF('CAMSS Assessment'!M11:M15, \"Yes\"), \"Yes\", \" \")","v":" "},null,null,null,{"$f":"( COUNTIF('CAMSS Assessment'!N11:N15, \"Yes\") + COUNTIF('CAMSS Assessment'!N11:N15, \"No\"))/5","v":0},{"$f":"(COUNTIF('CAMSS Assessment'!N11:N15,\"Yes\"))","v":0},{"$f":"COUNTIF('CAMSS Assessment'!N11:N15, \"No\")","v":0},{"$f":"COUNTIF('CAMSS Assessment'!N11:N15, \"Not Applicable\")","v":5}]
["R.3","Attributes",{"$f":"COUNTIF('CAMSS Assessment'!N16:N26, \"Yes\") / ( COUNTIF('CAMSS Assessment'!N16:N26, \"Yes\") + COUNTIF('CAMSS Assessment'!N16:N26, \"No\"))","v":{"$error":"#DIV/0!"}},null,{"$f":"IF(COUNTIF('CAMSS Assessment'!M16:M26, \"Yes\"), \"Yes\", \" \")","v":" "},null,null,null,{"$f":" ( COUNTIF('CAMSS Assessment'!N16:N26, \"Yes\") + COUNTIF('CAMSS Assessment'!N16:N26, \"No\"))/11","v":0},{"$f":"(COUNTIF('CAMSS Assessment'!N16:N26,\"Yes\"))","v":0},{"$f":" COUNTIF('CAMSS Assessment'!N16:N26, \"No\")","v":0},{"$f":" COUNTIF('CAMSS Assessment'!N16:N26, \"Not Applicable\")","v":11}]
["R.4","Requirements",{"$f":"COUNTIF('CAMSS Assessment'!N27:N53, \"Yes\") / ( COUNTIF('CAMSS Assessment'!N27:N53, \"Yes\") + COUNTIF('CAMSS Assessment'!N27:N53, \"No\"))","v":{"$error":"#DIV/0!"}},null,{"$f":"IF(COUNTIF('CAMSS Assessment'!M27:M53, \"Yes\"), \"Yes\", \" \")","v":" "},null,null,null,{"$f":" ( COUNTIF('CAMSS Assessment'!N27:N53, \"Yes\") + COUNTIF('CAMSS Assessment'!N27:N53, \"No\"))/27","v":0},{"$f":"(COUNTIF('CAMSS Assessment'!N27:N53,\"Yes\"))","v":0},{"$f":" COUNTIF('CAMSS Assessment'!N27:N53, \"No\")","v":0},{"$f":" COUNTIF('CAMSS Assessment'!N27:N53, \"Not Applicable\")","v":27}]
[null,"Overall score:",{"$f":"SUM(C4:C7)/4","v":{"$error":"#DIV/0!"}},null,null,null,null,null,{"$f":"SUM(I4:I7)/4","v":0}]
[]
[]
[]
[]
[null,null,null,null,null,"Proposed classification:",null,{"$f":"IF(COUNTIF(E4:E7,\"Yes\"),\"Discarded\",\"Select one of the values on the cell below\")","v":"Select one of the values on the cell below"}]
[]
[null,null,null,null,null,"Justification for classification:"]
[]
[null,null,null,null,null,"Legal impact/requirements of classification:"]